{"text_format":"3","workbook":"xlsx","n_sheets":13,"sheets":["Client Demographics","ADLs","Medical Needs","Nursing Assessment Indicators","Nighttime Needs","Social and Behavioral Needs","Enhanced or Exceptional","Support Needs Summary","Summary of In-Home Hours","2-1 Review and Approval","Raw Scoring","New Scoring","Control"],"not_rendered":{"images":24,"macros":1,"defined_names":218,"comments":1},"read":"whole","date_system":"1900"}

{"sheet":"Client Demographics","index":0,"n_rows":24,"n_cols":17,"rows_kept":24,"merged":[[0,0,0,16],[1,0,1,12],[2,0,2,2],[2,3,2,8],[2,9,2,10],[2,11,2,12],[2,13,2,14],[2,15,2,16],[3,0,3,2],[3,3,3,8],[3,9,3,10],[3,11,3,12],[3,13,3,14],[3,15,3,16],[4,0,4,2],[4,3,4,8],[4,9,4,10],[4,11,4,16],[5,0,5,5],[5,6,5,8],[5,9,5,10],[5,11,5,12],[6,0,6,2],[6,3,6,4],[6,5,6,10],[6,11,6,13],[6,14,6,16],[7,0,7,3],[7,4,7,7],[7,8,7,9],[7,10,7,12],[7,14,7,16],[8,0,9,3],[8,4,9,7],[8,8,8,9],[8,10,8,12],[8,14,8,16],[9,8,9,10],[9,11,9,16],[10,0,10,7],[10,8,10,12],[10,13,10,16],[11,1,11,7],[11,8,11,12],[11,13,11,15],[12,1,12,7],[12,8,12,12],[12,13,12,15],[13,1,13,7],[13,8,13,12],[13,13,13,15],[14,1,14,7],[14,8,14,12],[14,13,14,15],[15,1,15,7],[15,8,15,12],[15,13,15,15],[16,1,16,7],[16,8,16,12],[16,13,16,15],[17,0,17,2],[17,3,17,4],[17,5,17,7],[17,8,17,9],[17,12,17,13],[23,0,23,2]]}
["Adult In-Home Support Needs Assessment"]
["WARNING: Macros are currently disabled.  If this message persists after workbook initialization, please close this file, then reopen it and select either [Enable Macros] or [Enable Content], whichever option is displayed.\n\n* If you believe you have already enabled Macros/Content then:\n   1. First, select the Ribbon's File tab and, if you see a security warning, select the large [Enable Content v] shield button, \n        then \"Enable All Content\".\n   2. If you don't find a security warning then select the [Fix Me] button to the right, on this sheet."]
["(Legal Name) \nName of Individual",{"$nulls":8},"Date of Birth",{"$nulls":3},"Age",null,{"$f":"IF(OR(L3=\"\",AssessmentDate=\"\"),\n       \"\",\n       IF(DATEDIF(L3,AssessmentDate,\"Y\")=0,\n            DATEDIF(L3,AssessmentDate,\"YM\") & \" Month\" & IF(DATEDIF(L3,AssessmentDate,\"YM\")=1,\"\",\"s\"),\n            IF(DATEDIF(L3,AssessmentDate,\"Y\")=1,\n                 DATEDIF(L3,AssessmentDate,\"M\") & \" Months\",\n                 DATEDIF(L3,AssessmentDate,\"Y\"))))","v":""}]
["Prime #",{"$nulls":8},"Height",{"$nulls":3},"Weight"]
["Service Setting",null,null,"(Select)",{"$nulls":5},"Service Element",null,"(Select)"]
["Did the individual participate in the Assessment?",{"$nulls":5},"(Select)",null,null,"Gender",null,"(Select)"]
{"$rows_left_out":19}
{"sheet":"ADLs","index":1,"n_rows":143,"n_cols":14,"rows_kept":143,"merged":[[2,0,2,1],[3,0,3,1],[9,0,9,1],[10,0,10,1],[13,0,13,1],[14,0,14,1],[21,0,21,1],[22,0,22,1],[25,0,25,1],[26,0,26,1],[33,0,33,1],[34,0,34,1],[37,0,37,1],[38,0,38,1],[47,0,47,1],[48,0,48,1],[51,0,51,1],[52,0,52,1],[59,0,59,1],[60,0,60,1],[63,0,63,1],[65,0,65,1],[72,0,72,1],[73,0,73,1],[76,0,76,1],[77,0,77,1],[85,0,85,1],[86,0,86,1],[89,0,89,1],[90,0,90,1],[97,0,97,1],[98,0,98,1],[101,0,101,1],[102,0,102,1],[109,0,109,1],[110,0,110,1],[113,0,113,1],[114,0,114,1],[120,0,120,1],[121,0,121,1],[124,0,124,1],[125,0,125,1],[131,0,131,1],[132,0,132,1],[135,0,135,1],[136,0,136,1],[142,0,142,1],[143,0,143,1]]}
[{"$nulls":3},"Support Need","2:1 Review?","Documentation Needed","Selection\nValue","En/Dis-able\nOther","Disabled\nBy","Group #","Group","Name","Current\nState","Mismatch\nTrace"]
[null,"Rating selections must be applied in accordance with the “ANA/CNA Manual version 3”, available at http://www.dhs.state.or.us/spd/tools/dd/cm/"]
["TRANSPORTATION"]
[{"$f":"IF(INDEX('Raw Scoring'!D1:D13,MAX(J4:J10)+1)=\"Yes\",\"2:1 Review\",\"\")","v":""}]
[null,"This section assesses the individual's ability to provide or coordinate their own transportation to access their community.\nChoose the option that most accurately reflects the supports required by the individual, which are not due to behaviors.\n"]
[]
{"$rows_left_out":138}
{"sheet":"Medical Needs","index":2,"n_rows":164,"n_cols":14,"rows_kept":164,"merged":[[2,0,2,1],[3,0,3,1],[9,0,9,1],[10,0,10,1],[13,0,13,1],[14,0,14,1],[20,0,20,1],[21,0,21,1],[24,0,24,1],[25,0,25,1],[31,0,31,1],[32,0,32,1],[35,0,35,1],[36,0,36,1],[42,0,42,1],[43,0,43,1],[46,0,46,1],[47,0,47,1],[55,0,55,1],[56,0,56,1],[59,0,59,1],[60,0,60,1],[67,0,67,1],[68,0,68,1],[71,0,71,1],[72,0,72,1],[79,0,79,1],[80,0,80,1],[83,0,83,1],[84,0,84,1],[92,0,92,1],[93,0,93,1],[96,0,96,1],[97,0,97,1],[108,0,108,1],[109,0,109,1],[112,0,112,1],[113,0,113,1],[163,0,163,1],[164,0,164,1]]}
[{"$nulls":3},"Support Need","2:1 Review?","Documentation Needed","Selection\nValue","En/Dis-able\nOther","Disabled\nBy","Group #","Group","Name","Current\nState","Value\nMismatch"]
[null,"Rating selections must be applied in accordance with the “ANA/CNA Manual version 3”, available at http://www.dhs.state.or.us/spd/tools/dd/cm/"]
["COMMUNICATION - EXPRESSIVE & RECEPTIVE"]
[{"$f":"IF(INDEX('Raw Scoring'!P1:P18,MAX(J4:J10)+1)=\"Yes\",\"2:1 Review\",\"\")","v":""}]
[null,"This section assesses the individual's ability to verbally, or through adaptive means, understandably express to others their needs, and to understand information and directions from another person.  If the individual uses adaptive devices, assess support needed when the adaptive device is utilized.\nChoose the option that most accurately reflects the supports required by the individual.\n\n"]
[]
{"$rows_left_out":159}
{"sheet":"Nursing Assessment Indicators","index":3,"n_rows":0,"n_cols":0,"rows_kept":0}

{"sheet":"Nighttime Needs","index":4,"n_rows":15,"n_cols":14,"rows_kept":15,"merged":[[2,0,2,1],[3,0,3,1],[14,0,14,1],[15,0,15,1]]}
[{"$nulls":3},"Support Need","2:1 Review?","Documentation Needed","Selection\nValue","En/Dis-able\nOther","Disabled\nBy","Group #","Group","Name","Current\nState","Value\nMismatch"]
[null,"Rating selections must be applied in accordance with the “ANA/CNA Manual version 3”, available at http://www.dhs.state.or.us/spd/tools/dd/cm/"]
["NIGHTTIME NEEDS "]
[{"$f":"IF(INDEX('Raw Scoring'!J1:J2,MAX(J4:J10)+1)=\"Yes\",\"2:1 Review\",\"\")","v":""}]
[null,"This section assesses the individual's need for supports and monitoring during nighttime hours.\nChoose the option that most accurately reflects the supports required by the individual due to their disability.\n"]
[]
{"$rows_left_out":10}
{"sheet":"Social and Behavioral Needs","index":5,"n_rows":98,"n_cols":14,"rows_kept":98,"merged":[[2,0,2,1],[3,0,3,1],[4,0,4,1],[13,0,13,1],[14,0,14,1],[15,0,15,1],[16,0,16,1],[17,0,17,1],[25,0,25,1],[26,0,26,1],[27,0,27,1],[28,0,28,1],[29,0,29,1],[36,0,36,1],[37,0,37,1],[40,0,40,1],[41,0,41,1],[42,0,42,1],[50,0,50,1],[51,0,51,1],[54,0,54,1],[55,0,55,1],[56,0,56,1],[64,0,64,1],[65,0,65,1],[68,0,68,1],[69,0,69,1],[70,0,70,1],[82,0,82,1],[83,0,83,1],[86,0,86,1],[87,0,87,1],[88,0,88,1],[97,0,97,1],[98,0,98,1]]}
[{"$nulls":3},"Support Need","2:1 Review?","Documentation Needed","Selection\nValue","En/Dis-able\nOther","Disabled\nBy","Group #","Group","Name","Current\nState","Value\nMismatch"]
[null,"Rating selections must be applied in accordance with the “ANA/CNA Manual version 3”, available at http://www.dhs.state.or.us/spd/tools/dd/cm/"]
["COMMUNITY INTEGRATION SUPPORT"]
["Accessing and interacting in community settings"]
[{"$f":"IF(INDEX('Raw Scoring'!V:V,MAX(J5:J11)+1)=\"Yes\",\"2:1 Review\",\"\")","v":""}]
[null,"This item captures the support one needs to initiate, coordinate and complete or develop the skills to complete the steps of different tasks and activities in the community (i.e., bank, post office, library, restaurants, movie theatre, social services, etc.) using typical social standards (following rules, waiting in line, using appropriate language, tone, gestures and physical boundaries).  \nChoose the option that most accurately reflects the supports required by the individual."]
{"$rows_left_out":93}
{"sheet":"Enhanced or Exceptional","index":6,"n_rows":42,"n_cols":14,"rows_kept":42,"merged":[[31,0,31,1],[42,0,42,1]]}
[{"$nulls":3},"Support Need","2:1 Review?","Documentation Needed","Selection\nValue","En/Dis-able\nOther","Disabled\nBy","Group #","Group","Name","Current\nState","Value\nMismatch"]
[null,"Rating selections must be applied in accordance with “Enhanced/Exceptional Insert to the ANA/CNA Manual version 3”, available at http://www.dhs.state.or.us/spd/tools/dd/cm/"]
["ENHANCED or EXCEPTIONAL NEEDS "]
[]
[]
[null,"Nursing Tasks:  check the box for all nursing tasks for which the individual requires physical assistance from a caregiver.  Do not include tasks that the individual completes independently and for which the individual requires only monitoring, reminders or cuing.  Do not include tasks which are performed in a clinical setting by professional staff or which are performed by home health nurse."]
{"$rows_left_out":37}
{"sheet":"Support Needs Summary","index":7,"n_rows":181,"n_cols":4,"rows_kept":181,"merged":[[147,0,148,0],[155,0,156,0]]}
["SUPPORT NEEDS SUMMARY"]
[]
["ADLs","Support Needs Category"]
[null,{"$f":"ADLs!A3","v":"TRANSPORTATION"}]
[null,"Support Need","2:1 Review?","Documentation Needed"]
[null,"Independent","No","None"]
{"$rows_left_out":176}
{"sheet":"Summary of In-Home Hours","index":8,"n_rows":32,"n_cols":6,"rows_kept":32,"merged":[[0,0,0,5],[1,1,1,2],[1,4,1,5],[2,1,2,2],[2,4,2,5],[3,0,3,2],[3,3,4,3],[3,4,4,4],[3,5,4,5],[4,0,4,2],[5,0,5,2],[6,0,6,2],[7,0,7,2],[8,0,8,2],[9,0,9,2],[10,0,10,2],[10,4,11,5],[11,0,11,2],[12,0,12,2],[12,3,12,4],[14,0,14,2],[15,4,15,5],[16,0,17,2],[18,0,18,5],[18,6,18,11],[19,0,19,5],[20,1,20,2],[20,4,20,5],[22,0,23,0],[22,1,23,5]]}
["In Home Needs Summary - Adult"]
["Name of Individual ",{"$f":"IF(ClientName=0,\"\",ClientName)","v":""},null,"Date of Birth ",{"$f":"IF(ClientDOB=0,\"\",ClientDOB)","v":""}]
["Date of Assessment ",{"$f":"IF(AssessmentDate=0,\"\",AssessmentDate)","v":""},null,"Age ",{"$f":"ClientAge","v":""}]
[{"$nulls":3},"Assessed Hours\nPer Day","2:1 Review Required?",{"$f":"IF(AND(ISBLANK('2-1 Review and Approval'!$A$23),ISBLANK('2-1 Review and Approval'!$F$23)),\"\",\"Approved Monthly 2:1 Hours\")","v":""}]
[]
["ADL/IADL Hourly Supports",null,null,{"$f":"IF(ServiceSetting=ANA_GroupHome,\"N/A (SE 50 or 141)\",IF(ServiceSetting=ANA_FosterCare,\"N/A (SE 58)\",'Raw Scoring'!$K$9))","v":{"v":0,"d":"0.00"}},{"$f":"IF(NOT(ISNUMBER($D$6)),\"N/A\",ADLs2to1Rev)","v":"No"},{"$f":"IF(OR(E6=\"No\",E6=\"N/A\"),\" \",IF(AND(ISBLANK('2-1 Review and Approval'!$A$23),ISBLANK('2-1 Review and Approval'!$F$23)),\"Approval Required\",IF(SUM('2-1 Review and Approval'!L6:L8)>0,SUM('2-1 Review and Approval'!L6:L8),0)))","v":" "}]
{"$rows_left_out":21}
{"sheet":"2-1 Review and Approval","index":9,"n_rows":25,"n_cols":12,"rows_kept":25,"merged":[[1,0,1,1],[1,2,1,3],[1,5,1,6],[3,0,3,3],[3,6,3,10],[12,1,12,2],[14,0,14,3],[14,5,14,10],[15,0,15,3],[15,5,15,10],[17,0,17,3],[17,5,17,10],[18,0,18,3],[18,5,18,10],[20,0,20,3],[20,5,20,10],[22,0,22,1],[22,2,22,3],[22,5,22,7],[22,8,22,10],[24,0,24,3]]}
[]
["Review and Approval of 2 Person Supports",null,{"$f":"IF(ISBLANK('Client Demographics'!D3),\"\",'Client Demographics'!D3&\" - \"&'Client Demographics'!D4)","v":""},null,null,"DHS Review - 2:1 Exception",{"$nulls":3},"Date of Review/Determination: "]
[]
["1.  Determine the amount of 2 person hours that are necessary to safely provide the support.",{"$nulls":4},"ODDS Review Team: "]
[null,"Maximum Monthly \n2:1 Hours*","\nMonthly 2:1 Hours\nNeeded",{"$nulls":3},"\nMonthly 2:1 Hours\nApproved"]
["Mobility",{"$f":"IF(NOT(ISNUMBER('Summary of In-Home Hours'!$D$6)),0,IF('Raw Scoring'!D3=\"Yes\", 30, 0))","v":0},0,null,null,"Mobility",{"$nulls":5},{"$f":"IF(G6<>0,G6,IF(ISBLANK(C6),0,MIN(B6,C6)))","v":0}]
{"$rows_left_out":20}
{"sheet":"Raw Scoring","index":10,"n_rows":45,"n_cols":40,"rows_kept":45,"hidden":true,"merged":[[8,7,8,9],[9,7,9,9],[10,7,10,9],[11,7,11,9],[12,7,12,9],[13,7,13,9],[14,7,14,9],[15,7,15,9],[16,7,16,9],[17,7,17,9]]}
["ADL\nGroup ID","Selection\nValue","Adjusted\nValue","2:1 Review","New\nScoring\nRow","Hours","Nighttime\nGroup ID","Selection\nValue","Adjusted\nValue","2:1 Review","New\nScoring\nRow","Hours","Medical\nGroup ID","Selection\nValue","Adjusted\nValue","2:1 Review","New\nScoring\nRow","Hours","Social\nGroup ID","Selection\nValue","Adjusted\nValue","2:1 Review","New\nScoring\nRow","Hours","Behavior\nGroup ID","Selection\nValue","Behavior\nDuplication\nAdjustments","Adjusted\nValue","2:1 Review","New\nScoring\nRow","Hours",null,"EE_Nursing\nGroup ID","Selection\nValue",null,"EE_Behav\nGroup ID","Selection\nValue"]
["ADL1",0,{"$f":"B2","v":0},"N/A",{"$f":"MATCH(A2,'New Scoring'!$A:$A,0)+C2","v":3},{"$f":"IF(ScoringAge=0,0,OFFSET(NS_Values,E2-1,IF(D2=\"Yes\",Unreduced_NS_AgeCol,Default_NS_AgeCol)-1,1,1))","v":{"v":0,"d":"0.00"}},"Nighttime1",0,{"$f":"H2","v":0},"No",{"$f":"MATCH(G2,'New Scoring'!$A:$A,0)+I2","v":75},{"$f":"IF(ScoringAge=0,0,OFFSET(NS_Values,K2-1,IF(J2=\"Yes\",Unreduced_NS_AgeCol,Default_NS_AgeCol)-1,1,1))","v":{"v":0,"d":"0.00"}},"Medical1",0,{"$f":"N2","v":0},"N/A",{"$f":"MATCH(M2,'New Scoring'!$A:$A,0)+O2","v":81},{"$f":"IF(ScoringAge=0,0,OFFSET(NS_Values,Q2-1,IF(P2=\"Yes\",Unreduced_NS_AgeCol,Default_NS_AgeCol)-1,1,1))","v":{"v":0,"d":"0.00"}},"Social1",0,{"$f":"T2","v":0},"N/A",{"$f":"MATCH(S2,'New Scoring'!$A:$A,0)+U2","v":209},{"$f":"IF(ScoringAge=0,0,OFFSET(NS_Values,W2-1,Default_NS_AgeCol-1,1,1))","v":{"v":0,"d":"0.00"}},"Behavior1",0,null,{"$f":"(IF((AB4+AB5)>1,0,Z2))","v":0},"N/A",{"$f":"MATCH(Y2,'New Scoring'!$A:$A,0)+AB2","v":183},{"$f":"IF(ScoringAge=0,0,OFFSET(NS_Values,AD2-1,IF(AC2=\"Yes\",Unreduced_NS_AgeCol,Default_NS_AgeCol)-1,1,1))","v":{"v":0,"d":"0.00"}},null,"Ventilator1",0,null,"SupPlanImpl1",0,null,"EE_MedIsEnh:",{"$f":"IF(EE_NursingComplete,IF(EE_NursingEnh,$AN$9,$AN$11),IF(MedShEnh,$AN$12,$AN$11))","v":"N/A"}]
["ADL2",0,{"$f":"B3","v":0},"No",{"$f":"MATCH(A3,'New Scoring'!$A:$A,0)+C3","v":9},{"v":0,"d":"0.00"},"Totals",{"$f":"SUM(H2:H2)","v":0},{"$f":"MAX(I2:I2)","v":0},{"$f":"IF(COUNTIF(J1:J2,\"Yes\"),\"Yes\",\"No\")","v":"No"},null,{"$f":"SUM(L2:L2)","v":{"v":0,"d":"0.00"}},"Medical2",0,{"$f":"N3","v":0},"N/A",{"$f":"MATCH(M3,'New Scoring'!$A:$A,0)+O3","v":87},{"v":0,"d":"0.00"},"Social2",0,{"$f":"T3","v":0},"N/A",{"$f":"MATCH(S3,'New Scoring'!$A:$A,0)+U3","v":215},{"$f":"IF(ScoringAge=0,0,OFFSET(NS_Values,W3-1,Default_NS_AgeCol-1,1,1))","v":{"v":0,"d":"0.00"}},"Behavior2",0,null,{"$f":"Z3","v":0},"N/A",{"$f":"MATCH(Y3,'New Scoring'!$A:$A,0)+AB3","v":189},{"$f":"IF(ScoringAge=0,0,OFFSET(NS_Values,AD3-1,IF(AC3=\"Yes\",Unreduced_NS_AgeCol,Default_NS_AgeCol)-1,1,1))","v":{"v":0,"d":"0.00"}},null,"CPAP2",0,null,"SupPlanRevised2",0,null,"EE_MedIsExc:",{"$f":"IF(EE_NursingComplete,IF(EE_NursingExc,$AN$10,$AN$11),IF(OR(MedShEnh,MedShExc),$AN$12,$AN$11))","v":"N/A"}]
["ADL3",0,0,"No",{"$f":"MATCH(A4,'New Scoring'!$A:$A,0)+C4","v":15},{"v":0,"d":"0.00"},{"$nulls":6},"Medical3",0,0,"N/A",{"$f":"MATCH(M4,'New Scoring'!$A:$A,0)+O4","v":93},{"v":0,"d":"0.00"},"Social3",0,{"$f":"T4","v":0},"No",{"$f":"MATCH(S4,'New Scoring'!$A:$A,0)+U4","v":221},{"$f":"IF(ScoringAge=0,0,OFFSET(NS_Values,W4-1,Default_NS_AgeCol-1,1,1))","v":{"v":0,"d":"0.00"}},"Behavior3",0,{"$f":"Z2+Z4","v":0},{"$f":"IF(AA4 = 4,2,IF(AA4>4,3,Z4))","v":0},"N/A",{"$f":"MATCH(Y4,'New Scoring'!$A:$A,0)+AB4","v":195},{"$f":"IF(ScoringAge=0,0,OFFSET(NS_Values,AD4-1,IF(AC4=\"Yes\",Unreduced_NS_AgeCol,Default_NS_AgeCol)-1,1,1))","v":{"v":0,"d":"0.00"}},null,"Oxygen3",0,null,"CmplxTools3",0,null,"EE_MedIsEnhExc:",{"$f":"IF(EE_MedIsExc<>$AN$11,EE_MedIsExc,EE_MedIsEnh)","v":"N/A"}]
["ADL4",0,0,"N/A",{"$f":"MATCH(A5,'New Scoring'!$A:$A,0)+C5","v":21},{"v":0,"d":"0.00"},{"$nulls":6},"Medical4",0,0,"N/A",{"$f":"MATCH(M5,'New Scoring'!$A:$A,0)+O5","v":99},{"v":0,"d":"0.00"},"Totals",{"$f":"SUM(T2:T4)","v":0},{"$f":"SUM(U2:U4)","v":0},{"$f":"IF(COUNTIF(V1:V4,\"Yes\"),\"Yes\",\"No\")","v":"No"},null,{"$f":"SUM(X2:X4)","v":{"v":0,"d":"0.00"}},"Behavior4",0,null,{"$f":"Z5","v":0},"No",{"$f":"MATCH(Y5,'New Scoring'!$A:$A,0)+AB5","v":201},{"$f":"IF(ScoringAge=0,0,OFFSET(NS_Values,AD5-1,IF(AC5=\"Yes\",Unreduced_NS_AgeCol,Default_NS_AgeCol)-1,1,1))","v":{"v":0,"d":"0.00"}},null,"Resp4",0,null,"PPI4",0,null,"EE_BehavIsEnh:",{"$f":"IF(EE_BehavComplete,IF(EE_BehavEnh,$AN$9,$AN$11),IF(BehavShEnh,$AN$12,$AN$11))","v":"N/A"}]
["ADL5",0,0,"N/A",{"$f":"MATCH(A6,'New Scoring'!$A:$A,0)+C6","v":27},{"v":0,"d":"0.00"},{"$nulls":6},"Medical5",0,0,"N/A",{"$f":"MATCH(M6,'New Scoring'!$A:$A,0)+O6","v":105},{"v":0,"d":"0.00"},{"$nulls":6},"Totals",{"$f":"SUM(Z2:Z5)","v":0},null,{"$f":"SUM(AB2:AB5)","v":0},{"$f":"IF(COUNTIF(AC1:AC5,\"Yes\"),\"Yes\",\"No\")","v":"No"},null,{"$f":"SUM(AE2:AE5)","v":{"v":0,"d":"0.00"}},null,"Trach5",0,null,"TwentyHrs5",0,null,"EE_BehavIsExc:",{"$f":"IF(EE_BehavComplete,IF(EE_BehavExc,$AN$10,$AN$11),IF(OR(BehavShEnh,BehavShExc),$AN$12,$AN$11))","v":"N/A"}]
{"$rows_left_out":40}
{"sheet":"New Scoring","index":11,"n_rows":226,"n_cols":29,"rows_kept":226,"hidden":true,"merged":[[0,2,0,10],[0,15,0,23]]}
["Pre-Reduction:",{"v":0,"d":"0%"},"ANA - NEW BREAKPOINTS (Same scores)",{"$nulls":8},{"$f":"IF(OR(ServiceElement=SE51SelectionStr,MinLT14HrRdcnOvrrd),0,$B$1)","v":{"v":0,"d":"0%"}},{"$nulls":3},"ANA - NEW BREAKPOINTS (Same scores)",{"$nulls":10},"Values Last updated"]
["Category","Selection\nValue","0-2",3,4,5,"6-9","10-11","12-14","15-17","18+","Hours per\nMonth","Topic","NOTE: Blue font items are formulas!",null,"0-2",3,4,5,"6-9","10-11","12-14","15-17","18+","Hours per\nDay plus...","Minutes\nper Day","2016-04-19","Score\nRange Names","Unreduced\nRange Names"]
["ADL1",0,{"$f":"P3-(P3*$L$1)","v":0},{"$f":"Q3-(Q3*$L$1)","v":0},{"$f":"R3-(R3*$L$1)","v":0},{"$f":"S3-(S3*$L$1)","v":0},{"$f":"T3-(T3*$L$1)","v":0},{"$f":"U3-(U3*$L$1)","v":0},{"$f":"V3-(V3*$L$1)","v":0},{"$f":"W3-(W3*$L$1)","v":0},{"$f":"X3-(X3*$L$1)","v":0},{"$f":"K3*DaysPerMo","v":0},"Transportation",null,null,0,0,0,0,0,0,0,null,{"$f":"$Y3+$Z3/60","v":0},null,0,null,"NS_Age0to2","UR_Age0to2"]
["ADL1",1,0,0,0,0,0,0,0,0,{"v":0.03285,"d":"0.033"},{"v":0.9989684999999999,"d":"1.00"},{"$nulls":3},0,0,0,0,0,0,0,null,{"v":0.03285,"d":"0.033"},null,{"v":1.9709999999999999,"d":"1.97"},"(Fractions are derived from","NS_Age3","UR_Age3"]
["ADL1",2,0,0,0,0,0,0,0,0,{"v":0.03285,"d":"0.033"},{"v":0.9989684999999999,"d":"1.00"},{"$nulls":3},0,0,0,0,0,0,0,null,{"v":0.03285,"d":"0.033"},null,{"v":1.9709999999999999,"d":"1.97"},"original, version-A values)","NS_Age4","UR_Age4"]
["ADL1",3,0,0,0,0,0,0,0,0,{"v":0.0657,"d":"0.066"},{"v":1.9979369999999999,"d":"2.00"},{"$nulls":3},0,0,0,0,0,0,0,null,{"v":0.0657,"d":"0.066"},null,{"v":3.9419999999999997,"d":"3.94"},null,"NS_Age5","UR_Age5"]
{"$rows_left_out":221}
{"sheet":"Control","index":12,"n_rows":56,"n_cols":30,"rows_kept":56,"hidden":true}
[null,"Before-Save\nActive Sheet",null,"County/Brokerage LookUp",null,"Relationships",null,"Support Need Options - ADL","Support Need Options - Medical","Support Need Options - Nighttime","Documentation Needed Options","Support Need Options - Behavior","Documentation Needed Options - Behavior",null,"This\nTool-Type","Tool-Type\nIndex",null,"ANA\nService Settings","ANA\nSE Mapping","CNA\nService Settings","CNA\nSE Mapping",null,"SE No Options","ANA\nSE Non-Group Home","CNA\nSE Non-Group Home","CNA\nSE C-W Foster Care","SE Foster Care","ANA\nSE Group Home","CNA\nSE Group Home","SE Other"]
[null,"Client Demographics",null,"(Select)",null,"(Select)",null,"Independent","Independent","Independent","None","Not Applicable or Age-Appropriate Supervision","None",null,{"$f":"LEFT(TRIM(VersionDisplay), FIND(\" \",TRIM(VersionDisplay)) - 1)","v":"ANA"},{"$f":"IF(O2=\"ANA\",0,IF(O2=\"CNA\",1,\"#VALUE!\"))","v":0},null,"(Select)","SE_NoOptions","(Select)","SE_NoOptions",null,"(Select)","(Select)","(Select)","(Select)","Foster Care (SE 58)","24hr Residential (SE 50)","24hr Residential (SE 50)","(Explain in comment field of \"Summary of In-Home Hours\" sheet)"]
[{"$nulls":3},"Community Pathways",null,"Self",null,"Independent or Age Appropriate Supports Provided","Independent or Age Appropriate Supports Provided","Nighttime Assist - monthly","Caregivers' schedules and duties","Within Hearing or Visual Distance","OIS Training",{"$nulls":4},"Family Home","SE_NonGroupHome_ANA","Family Home","SE_NonGroupHome_CNA",null,null,"Comp In-Home (SE 49)","Child Long-term Support (SE 151)","Child Long-term Support (SE 151)",null,"SACU (SE 141)","Child Residential (SE 142)"]
[null,"Keep Current File Name",null,"CSI",null,"Legal Guardian",null,"Partial Assist","Individual-Directed Care","Nighttime Assist - weekly","Caregivers' schedules and duties, OIS IF-M Level training","Within Hearing and Visual Distance","Functional Assessment and Formal Behavior Support Plan",{"$nulls":4},"Own Home","SE_NonGroupHome_ANA","Child-welfare Foster","SE_CW_FosterCare",null,null,"Brokerage In-Home (SE 149)","CIIS (SE 145)","CIIS (SE 145)",null,null,"SACU (SE 141)"]
[null,true,null,"EOSSB",null,"Parent",null,"Partial Assist - assistance","Partial Assist","Nighttime Assist - intermittent nightly","Not Applicable","Redirecting","Functional Assessment and Formal Behavior Support Plan, OIS Training",{"$nulls":4},"Foster Care","SE_FosterCare","DD Foster","SE_FosterCare",null,null,"Supported Living (SE 51)",null,"Foster Care (SE 58)","^ NOTE: Shaded cell's named-range SE_FosterCare is also referenced by CNA's \"Summary of In-Home Hours\" sheet formula"]
[{"$nulls":3},"Full Access",null,"Provider/Staff",null,"Partial Assist - cueing","Partial Assist - 1 to 3 per day","Nighttime Assist - ongoing nightly",null,"Behavior Plan - No Physical Interventions","Functional Assessment and Formal Behavior Support Plan if indicated by the FA",{"$nulls":4},"24-hr. Group Home","SE_GroupHome_ANA","24-hr. Group Home","SE_GroupHome_CNA",null,null,"* BEWARE: Shaded cell is referenced by the \"New Scoring\" sheet",null,"* Shaded cell is same CNA value as SE_FosterCare so SE_FosterCare is referenced, for both cases, by CNA's \"Summary of In-Home Hours\" formula"]
{"$rows_left_out":50}